The International Simutrans Forum

 

Author Topic: Build failed in Jenkins: simutrans » sdl,16,linux #29  (Read 1200 times)

0 Members and 1 Guest are viewing this topic.

Offline ArthurDenture

  • Coder/patcher
  • *
  • Posts: 86
Build failed in Jenkins: simutrans » sdl,16,linux #29
« on: September 12, 2013, 11:48:27 PM »
Note: this is a manual paste of an email sent by the new continuous build. I haven't figure out yet how to make the build post to the forum when breakage happens. tl;dr looks like a file was omitted from r6702.

See <http://ec2-54-242-171-11.compute-1.amazonaws.com/jenkins/job/simutrans/./BACKEND=sdl,COLOUR_DEPTH=16,OSTYPE=linux/29/changes>

Changes:

[prissi] ADD: loading gui themes on runtime

------------------------------------------
Started by upstream project "simutrans" build number 29
Building in workspace <http://ec2-54-242-171-11.compute-1.amazonaws.com/jenkins/job/simutrans/./BACKEND=sdl,COLOUR_DEPTH=16,OSTYPE=linux/ws/>
Checkout:linux / <http://ec2-54-242-171-11.compute-1.amazonaws.com/jenkins/job/simutrans/./BACKEND=sdl,COLOUR_DEPTH=16,OSTYPE=linux/ws/> - hudson.remoting.LocalChannel@9cbfa1
Using strategy: Default
Last Built Revision: Revision 3973708d09984838a741bf4fd386131026cdd906 (origin/master)
Fetching changes from 1 remote Git repository
Fetching upstream changes from http://github.com/aburch/simutrans
Commencing build of Revision 6faf369592e146f9d966d49226f8e301ccb3ea66 (origin/master)
Checking out Revision 6faf369592e146f9d966d49226f8e301ccb3ea66 (origin/master)
Deleting old artifacts from #27
[linux] $ /bin/sh -xe /opt/bitnami/apache-tomcat/temp/hudson606124179418511477.sh
+ cat
+ cat config.default
BACKEND=sdl
COLOUR_DEPTH=16
OSTYPE=linux
SDL2_CONFIG=~/bin/sdl2-config
[linux] $ /bin/sh -xe /opt/bitnami/apache-tomcat/temp/hudson6882734510381645319.sh
+ make clean
===> Cleaning up
+ make
===> CXX clipboard_internal.cc
===> CXX bauer/brueckenbauer.cc
In file included from bauer/../gui/messagebox.h:4:0,
                 from bauer/brueckenbauer.cc:24:
bauer/../gui/gui_frame.h:23:23: fatal error: gui_theme.h: No such file or directory
compilation terminated.
make: *** [build/default/bauer/brueckenbauer.o] Error 1
Build step 'Execute shell' marked build as failure
[WARNINGS] Skipping publisher since build result is FAILURE
[ANALYSIS-COLLECTOR] Skipping publisher since build result is FAILURE
Archiving artifacts

Offline kierongreen

  • Dev Team, Coder/patcher
  • Devotee
  • *
  • Posts: 2346
Re: Build failed in Jenkins: simutrans » sdl,16,linux #29
« Reply #1 on: September 12, 2013, 11:52:34 PM »
Indeed - prissi forgot to add some files to svn in commit 6702.